Reaction Details
TargetBromodomain adjacent to zinc finger domain protein 2B
LigandBDBM50200384
Substrate/Competitorn/a
Meas. Tech.ChEMBL_1622054 (CHEMBL3864406)
IC50>20000±n/a nM
Citation Crawford, TDRomero, FALai, KWTsui, VTaylor, AMde Leon Boenig, GNoland, CLMurray, JLy, JChoo, EFHunsaker, TLChan, EWMerchant, MKharbanda, SGascoigne, KEKaufman, SBeresini, MHLiao, JLiu, WChen, KXChen, ZConery, ARCôté, AJayaram, HJiang, YKiefer, JRKleinheinz, TLi, YMaher, JPardo, EPoy, FSpillane, KLWang, FWang, JWei, XXu, ZXu, ZYen, IZawadzke, LZhu, XBellon, SCummings, RCochran, AGAlbrecht, BKMagnuson, S Discovery of a Potent and Selective in Vivo Probe (GNE-272) for the Bromodomains of CBP/EP300. J Med Chem59:10549-10563 (2016) 
 
Bromodomain adjacent to zinc finger domain protein 2B
Name:Bromodomain adjacent to zinc finger domain protein 2B
Type:PROTEIN
Mol. Mass.:240455.43
Organism:Homo sapiens (Human)
Description:ChEMBL_1498197
Residue:2168
BDBM50200384
NameBDBM50200384
Synonyms:CHEMBL3968533 | US9763922, Example 299
TypeSmall organic molecule
Emp. Form.C22H25FN6O2
Mol. Mass.424.4713
SMILESCC(=O)N1CCc2c(C1)c(Nc1ccc(cc1F)-c1cnn(C)c1)nn2[C@@H]1CCOC1