Reaction Details
TargetKelch-like ECH-associated protein 1
LigandBDBM50200469
Substrate/Competitorn/a
Meas. Tech.ChEMBL_1622119 (CHEMBL3864471)
Kd 96±n/a nM
Citation Jiang, ZYLu, MCYou, QD Discovery and Development of Kelch-like ECH-Associated Protein 1. Nuclear Factor Erythroid 2-Related Factor 2 (KEAP1:NRF2) Protein-Protein Interaction Inhibitors: Achievements, Challenges, and Future Directions. J Med Chem59:10837-10858 (2016) 
 
Kelch-like ECH-associated protein 1
Name:Kelch-like ECH-associated protein 1
Type:PROTEIN
Mol. Mass.:69664.53
Organism:Homo sapiens (Human)
Description:ChEMBL_107924
Residue:624
BDBM50200469
NameBDBM50200469
Synonyms:CHEMBL3946551
TypeSmall organic molecule
Emp. Form.C58H63N9O22S
Mol. Mass.1270.233
SMILESC[C@@H](O)[C@H](NC(=O)[C@H](CCC(O)=O)NC(=O)[C@H](CCC(O)=O)NC(=O)[C@H](CC(O)=O)NC(=O)CCNC(=O)c1ccc(cc1C1c2ccc(O)cc2Oc2cc(O)ccc12)N=C=S)C(=O)NCC(=O)N[C@@H](CCC(O)=O)C(=O)N[C@@H](Cc1ccccc1)C(O)=O