Reaction Details
TargetKelch-like ECH-associated protein 1
LigandBDBM50200473
Substrate/Competitorn/a
Meas. Tech.ChEMBL_1622122 (CHEMBL3864474)
IC50 248±n/a nM
Citation Jiang, ZYLu, MCYou, QD Discovery and Development of Kelch-like ECH-Associated Protein 1. Nuclear Factor Erythroid 2-Related Factor 2 (KEAP1:NRF2) Protein-Protein Interaction Inhibitors: Achievements, Challenges, and Future Directions. J Med Chem59:10837-10858 (2016) 
 
Kelch-like ECH-associated protein 1
Name:Kelch-like ECH-associated protein 1
Type:PROTEIN
Mol. Mass.:69664.53
Organism:Homo sapiens (Human)
Description:ChEMBL_107924
Residue:624
BDBM50200473
NameBDBM50200473
Synonyms:CHEMBL3908796
TypeSmall organic molecule
Emp. Form.C36H49N7O16
Mol. Mass.835.8116
SMILESC[C@@H](O)[C@H](NC(=O)[C@H](CCC(O)=O)NC(=O)[C@@H]1CCCN1C(=O)[C@H](CC(O)=O)NC(C)=O)C(=O)NCC(=O)N[C@@H](CCC(O)=O)C(=O)N[C@@H](Cc1ccccc1)C(O)=O