Reaction Details
TargetPotassium voltage-gated channel subfamily H member 2
LigandBDBM50200537
Substrate/Competitorn/a
Meas. Tech.ChEMBL_1622549 (CHEMBL3864901)
IC50>12250±n/a nM
Citation Han, MWang, CJi, YSong, ZXing, LSu, YWang, XZhang, AAi, JGeng, M Metabolism-based structure optimization: Discovery of a potent and orally available tyrosine kinase ALK inhibitor bearing the tetracyclic benzo[b]carbazolone core. Bioorg Med Chem Lett26:5399-5402 (2016) 
 
Potassium voltage-gated channel subfamily H member 2
Name:Potassium voltage-gated channel subfamily H member 2
Type:Multi-pass membrane protein
Mol. Mass.:126672.65
Organism:Homo sapiens (Human)
Description:Q12809
Residue:1159
BDBM50200537
NameBDBM50200537
Synonyms:CHEMBL3736267
TypeSmall organic molecule
Emp. Form.C30H33N3O3
Mol. Mass.483.6013
SMILESCC1(C)c2[nH]c3cc(ccc3c2C(=O)c2ccc(cc12)C1CCN(CC2(O)CCOCC2)CC1)C#N