Reaction Details
TargetCaspase-5
LigandBDBM50200545
Substrate/Competitorn/a
Meas. Tech.ChEMBL_1622627 (CHEMBL3864979)
IC50 146±n/a nM
Citation Kent, CRBryja, MGustafson, HAKawarski, MYLenti, GPierce, ENKnopp, RCCeja, VPati, BWalters, DEKarver, CE Variation of the aryl substituent on the piperazine ring within the 4-(piperazin-1-yl)-2,6-di(pyrrolidin-1-yl)pyrimidine scaffold unveils potent, non-competitive inhibitors of the inflammatory caspases. Bioorg Med Chem Lett26:5476-5480 (2016) 
 
Caspase-5
Name:Caspase-5
Type:Enzyme
Mol. Mass.:49760.80
Organism:Homo sapiens (Human)
Description:P51878
Residue:434
BDBM50200545
NameBDBM50200545
Synonyms:CHEMBL3965572
TypeSmall organic molecule
Emp. Form.C22H31N7
Mol. Mass.393.5284
SMILESC(N1CCN(CC1)c1cc(nc(n1)N1CCCC1)N1CCCC1)c1ccncc1