Reaction Details
TargetCaspase-5
LigandBDBM50200554
Substrate/Competitorn/a
Meas. Tech.ChEMBL_1622627 (CHEMBL3864979)
IC50 586±n/a nM
Citation Kent, CRBryja, MGustafson, HAKawarski, MYLenti, GPierce, ENKnopp, RCCeja, VPati, BWalters, DEKarver, CE Variation of the aryl substituent on the piperazine ring within the 4-(piperazin-1-yl)-2,6-di(pyrrolidin-1-yl)pyrimidine scaffold unveils potent, non-competitive inhibitors of the inflammatory caspases. Bioorg Med Chem Lett26:5476-5480 (2016) 
 
Caspase-5
Name:Caspase-5
Type:Enzyme
Mol. Mass.:49760.80
Organism:Homo sapiens (Human)
Description:P51878
Residue:434
BDBM50200554
NameBDBM50200554
Synonyms:CHEMBL3968765
TypeSmall organic molecule
Emp. Form.C24H31F3N6
Mol. Mass.460.5383
SMILESFC(F)(F)c1ccc(CN2CCN(CC2)c2cc(nc(n2)N2CCCC2)N2CCCC2)cc1