Reaction Details
TargetCaspase-5
LigandBDBM50200556
Substrate/Competitorn/a
Meas. Tech.ChEMBL_1622627 (CHEMBL3864979)
Ki 24±n/a nM
Citation Kent, CRBryja, MGustafson, HAKawarski, MYLenti, GPierce, ENKnopp, RCCeja, VPati, BWalters, DEKarver, CE Variation of the aryl substituent on the piperazine ring within the 4-(piperazin-1-yl)-2,6-di(pyrrolidin-1-yl)pyrimidine scaffold unveils potent, non-competitive inhibitors of the inflammatory caspases. Bioorg Med Chem Lett26:5476-5480 (2016) 
 
Caspase-5
Name:Caspase-5
Type:Enzyme
Mol. Mass.:49760.80
Organism:Homo sapiens (Human)
Description:P51878
Residue:434
BDBM50200556
NameBDBM50200556
Synonyms:CHEMBL3904435
TypeSmall organic molecule
Emp. Form.C23H31N7O2
Mol. Mass.437.5379
SMILES[O-][N+](=O)c1ccccc1CN1CCN(CC1)c1cc(nc(n1)N1CCCC1)N1CCCC1