Reaction Details
TargetEctonucleotide pyrophosphatase/phosphodiesterase family member 2
LigandBDBM50200667
Substrate/Competitorn/a
Meas. Tech.ChEMBL_1622710 (CHEMBL3865062)
IC50 39±n/a nM
Citation Shah, PCheasty, AFoxton, CRaynham, TFarooq, MGutierrez, IFLejeune, APritchard, MTurnbull, APang, LOwen, PBoyd, SStowell, AJordan, AHamilton, NMHitchin, JRStockley, MMacDonald, EQuesada, MJTrivier, ESkeete, JOvaa, HMoolenaar, WHRyder, H Discovery of potent inhibitors of the lysophospholipase autotaxin. Bioorg Med Chem Lett26:5403-5410 (2016) 
 
Ectonucleotide pyrophosphatase/phosphodiesterase family member 2
Name:Ectonucleotide pyrophosphatase/phosphodiesterase family member 2
Type:Enzyme
Mol. Mass.:99007.13
Organism:Homo sapiens (Human)
Description:Q13822
Residue:863
BDBM50200667
NameBDBM50200667
Synonyms:CHEMBL3954360
TypeSmall organic molecule
Emp. Form.C23H20F2N4O2
Mol. Mass.422.4273
SMILESC[C@H](NC(=O)COc1nc2cccnc2n1Cc1ccc(F)cc1)c1ccc(F)cc1