Reaction Details
TargetEctonucleotide pyrophosphatase/phosphodiesterase family member 2
LigandBDBM50200666
Substrate/Competitorn/a
Meas. Tech.ChEMBL_1622710 (CHEMBL3865062)
IC50 6±n/a nM
Citation Shah, PCheasty, AFoxton, CRaynham, TFarooq, MGutierrez, IFLejeune, APritchard, MTurnbull, APang, LOwen, PBoyd, SStowell, AJordan, AHamilton, NMHitchin, JRStockley, MMacDonald, EQuesada, MJTrivier, ESkeete, JOvaa, HMoolenaar, WHRyder, H Discovery of potent inhibitors of the lysophospholipase autotaxin. Bioorg Med Chem Lett26:5403-5410 (2016) 
 
Ectonucleotide pyrophosphatase/phosphodiesterase family member 2
Name:Ectonucleotide pyrophosphatase/phosphodiesterase family member 2
Type:Enzyme
Mol. Mass.:99007.13
Organism:Homo sapiens (Human)
Description:Q13822
Residue:863
BDBM50200666
NameBDBM50200666
Synonyms:CHEMBL3916898
TypeSmall organic molecule
Emp. Form.C24H22F2N4O
Mol. Mass.420.4545
SMILESC[C@H](NC(=O)CCc1nc2cccnc2n1Cc1ccc(F)cc1)c1ccc(F)cc1