Reaction Details
TargetEctonucleotide pyrophosphatase/phosphodiesterase family member 2
LigandBDBM50200624
Substrate/Competitorn/a
Meas. Tech.ChEMBL_1622711 (CHEMBL3865063)
IC50 34±n/a nM
Citation Shah, PCheasty, AFoxton, CRaynham, TFarooq, MGutierrez, IFLejeune, APritchard, MTurnbull, APang, LOwen, PBoyd, SStowell, AJordan, AHamilton, NMHitchin, JRStockley, MMacDonald, EQuesada, MJTrivier, ESkeete, JOvaa, HMoolenaar, WHRyder, H Discovery of potent inhibitors of the lysophospholipase autotaxin. Bioorg Med Chem Lett26:5403-5410 (2016) 
 
Ectonucleotide pyrophosphatase/phosphodiesterase family member 2
Name:Ectonucleotide pyrophosphatase/phosphodiesterase family member 2
Type:Enzyme
Mol. Mass.:99007.13
Organism:Homo sapiens (Human)
Description:Q13822
Residue:863
BDBM50200624
NameBDBM50200624
Synonyms:CHEMBL3912114
TypeSmall organic molecule
Emp. Form.C25H22ClF3N4O2
Mol. Mass.502.916
SMILESC[C@H](NC(=O)CCc1nc2ccncc2n1Cc1ccc(OC(F)(F)F)cc1)c1ccc(Cl)cc1