Reaction Details
TargetVoltage-dependent T-type calcium channel subunit alpha-1H
LigandBDBM50200812
Substrate/Competitorn/a
Meas. Tech.ChEMBL_1622852 (CHEMBL3865204)
IC50 91±n/a nM
Citation Siegrist, RPozzi, DJacob, GTorrisi, CColas, KBraibant, BMawet, JPfeifer, Tde Kanter, RRoch, CKessler, MCorminboeuf, OBezençon, O Structure-Activity Relationship, Drug Metabolism and Pharmacokinetics Properties Optimization, and in Vivo Studies of New Brain Penetrant Triple T-Type Calcium Channel Blockers. J Med Chem59:10661-10675 (2016) 
 
Voltage-dependent T-type calcium channel subunit alpha-1H
Name:Voltage-dependent T-type calcium channel subunit alpha-1H
Type:Enzyme Catalytic Domain
Mol. Mass.:259187.68
Organism:Homo sapiens (Human)
Description:Calcium channel (Type T,L) 0 0::O95180
Residue:2353
BDBM50200812
NameBDBM50200812
Synonyms:CHEMBL3985310
TypeSmall organic molecule
Emp. Form.C22H30N4O
Mol. Mass.366.4998
SMILESCC(C)CCN1C[C@@H](C)N([C@@H](C)c2ccccc12)C(=O)Nc1cccnc1