Reaction Details
TargetVoltage-dependent T-type calcium channel subunit alpha-1I
LigandBDBM50200874
Substrate/Competitorn/a
Meas. Tech.ChEMBL_1622853 (CHEMBL3865205)
IC50 8.0±n/a nM
Citation Siegrist, RPozzi, DJacob, GTorrisi, CColas, KBraibant, BMawet, JPfeifer, Tde Kanter, RRoch, CKessler, MCorminboeuf, OBezençon, O Structure-Activity Relationship, Drug Metabolism and Pharmacokinetics Properties Optimization, and in Vivo Studies of New Brain Penetrant Triple T-Type Calcium Channel Blockers. J Med Chem59:10661-10675 (2016) 
 
Voltage-dependent T-type calcium channel subunit alpha-1I
Name:Voltage-dependent T-type calcium channel subunit alpha-1I
Type:PROTEIN
Mol. Mass.:245101.25
Organism:Homo sapiens (Human)
Description:ChEMBL_538845
Residue:2223
BDBM50200874
NameBDBM50200874
Synonyms:CHEMBL3979902
TypeSmall organic molecule
Emp. Form.C24H30N2O2
Mol. Mass.378.5072
SMILESC[C@@H]1CN(Cc2ccccc2)c2ccccc2[C@H](C)N1C(=O)C1CCOCC1