Reaction Details
TargetVoltage-dependent T-type calcium channel subunit alpha-1G
LigandBDBM50200870
Substrate/Competitorn/a
Meas. Tech.ChEMBL_1622851 (CHEMBL3865203)
IC50 102±n/a nM
Citation Siegrist, RPozzi, DJacob, GTorrisi, CColas, KBraibant, BMawet, JPfeifer, Tde Kanter, RRoch, CKessler, MCorminboeuf, OBezençon, O Structure-Activity Relationship, Drug Metabolism and Pharmacokinetics Properties Optimization, and in Vivo Studies of New Brain Penetrant Triple T-Type Calcium Channel Blockers. J Med Chem59:10661-10675 (2016) 
 
Voltage-dependent T-type calcium channel subunit alpha-1G
Name:Voltage-dependent T-type calcium channel subunit alpha-1G
Type:PROTEIN
Mol. Mass.:262471.14
Organism:Homo sapiens (Human)
Description:ChEMBL_1515216
Residue:2377
BDBM50200870
NameBDBM50200870
Synonyms:CHEMBL3959377
TypeSmall organic molecule
Emp. Form.C25H27N3O
Mol. Mass.385.5014
SMILESC[C@@H]1CN(Cc2ccccc2)c2ccccc2CN1C(=O)NCc1ccccc1