Reaction Details
TargetVoltage-dependent T-type calcium channel subunit alpha-1G
LigandBDBM50200900
Substrate/Competitorn/a
Meas. Tech.ChEMBL_1622851 (CHEMBL3865203)
IC50 25±n/a nM
Citation Siegrist, RPozzi, DJacob, GTorrisi, CColas, KBraibant, BMawet, JPfeifer, Tde Kanter, RRoch, CKessler, MCorminboeuf, OBezençon, O Structure-Activity Relationship, Drug Metabolism and Pharmacokinetics Properties Optimization, and in Vivo Studies of New Brain Penetrant Triple T-Type Calcium Channel Blockers. J Med Chem59:10661-10675 (2016) 
 
Voltage-dependent T-type calcium channel subunit alpha-1G
Name:Voltage-dependent T-type calcium channel subunit alpha-1G
Type:PROTEIN
Mol. Mass.:262471.14
Organism:Homo sapiens (Human)
Description:ChEMBL_1515216
Residue:2377
BDBM50200900
NameBDBM50200900
Synonyms:CHEMBL3949063
TypeSmall organic molecule
Emp. Form.C26H27F3N4O
Mol. Mass.468.514
SMILESC[C@@H]1CN(Cc2cccc(n2)C(F)(F)F)c2ccccc2[C@H](C)N1C(=O)NCc1ccccc1