Reaction Details
TargetVoltage-dependent T-type calcium channel subunit alpha-1H
LigandBDBM50200851
Substrate/Competitorn/a
Meas. Tech.ChEMBL_1622852 (CHEMBL3865204)
IC50 13±n/a nM
Citation Siegrist, RPozzi, DJacob, GTorrisi, CColas, KBraibant, BMawet, JPfeifer, Tde Kanter, RRoch, CKessler, MCorminboeuf, OBezençon, O Structure-Activity Relationship, Drug Metabolism and Pharmacokinetics Properties Optimization, and in Vivo Studies of New Brain Penetrant Triple T-Type Calcium Channel Blockers. J Med Chem59:10661-10675 (2016) 
 
Voltage-dependent T-type calcium channel subunit alpha-1H
Name:Voltage-dependent T-type calcium channel subunit alpha-1H
Type:Enzyme Catalytic Domain
Mol. Mass.:259187.68
Organism:Homo sapiens (Human)
Description:Calcium channel (Type T,L) 0 0::O95180
Residue:2353
BDBM50200851
NameBDBM50200851
Synonyms:CHEMBL3969822
TypeSmall organic molecule
Emp. Form.C25H26F3N3O2
Mol. Mass.457.488
SMILESC[C@@H]1CN(Cc2ccc(o2)C(F)(F)F)c2ccccc2[C@H](C)N1C(=O)NCc1ccccc1