Reaction Details
TargetAdenosine receptor A2a
LigandBDBM50200988
Substrate/Competitorn/a
Meas. Tech.ChEMBL_1622887 (CHEMBL3865239)
Ki 0.800000±n/a nM
Citation Rosse, G Quinazoline Carboxamides as Selective Antagonists of Adenosine 2A Receptor. ACS Med Chem Lett7:1014-1015 (2016) 
 
Adenosine receptor A2a
Name:Adenosine receptor A2a
Type:G Protein-Coupled Receptor (GPCR)
Mol. Mass.:44716.46
Organism:Homo sapiens (Human)
Description:P29274
Residue:412
BDBM50200988
NameBDBM50200988
Synonyms:CHEMBL3977457 | US10138212, Example 21
TypeSmall organic molecule
Emp. Form.C17H17N5O3
Mol. Mass.339.3486
SMILESCOc1cccc(CNC(=O)c2nc(N)nc3c(OC)cccc23)n1