Reaction Details
TargetTyrosine-protein kinase Mer
LigandBDBM50201075
Substrate/Competitorn/a
Meas. Tech.ChEMBL_1622920 (CHEMBL3865272)
IC50 4.0±n/a nM
Citation Wang, XLiu, JZhang, WStashko, MANichols, JMiley, MJNorris-Drouin, JChen, ZMachius, MDeRyckere, DWood, EGraham, DKEarp, HSKireev, DFrye, SV Design and Synthesis of Novel Macrocyclic Mer Tyrosine Kinase Inhibitors. ACS Med Chem Lett7:1044-1049 (2016) 
 
Tyrosine-protein kinase Mer
Name:Tyrosine-protein kinase Mer
Type:PROTEIN
Mol. Mass.:110234.77
Organism:Homo sapiens (Human)
Description:ChEMBL_1498723
Residue:999
BDBM50201075
NameBDBM50201075
Synonyms:CHEMBL3956694
TypeSmall organic molecule
Emp. Form.C29H42N6O
Mol. Mass.490.6834
SMILESCN1CCN(Cc2ccc(cc2)-c2cn3CCCCC(O)CCCCCCNc4ncc2c3n4)CC1