Reaction Details
TargetTyrosine-protein kinase receptor TYRO3
LigandBDBM50201077
Substrate/Competitorn/a
Meas. Tech.ChEMBL_1622922 (CHEMBL3865274)
IC50 22±n/a nM
Citation Wang, XLiu, JZhang, WStashko, MANichols, JMiley, MJNorris-Drouin, JChen, ZMachius, MDeRyckere, DWood, EGraham, DKEarp, HSKireev, DFrye, SV Design and Synthesis of Novel Macrocyclic Mer Tyrosine Kinase Inhibitors. ACS Med Chem Lett7:1044-1049 (2016) 
 
Tyrosine-protein kinase receptor TYRO3
Name:Tyrosine-protein kinase receptor TYRO3
Type:Protein
Mol. Mass.:96894.13
Organism:Homo sapiens (Human)
Description:Q06418
Residue:890
BDBM50201077
NameBDBM50201077
Synonyms:CHEMBL3967759
TypeSmall organic molecule
Emp. Form.C31H46N6O
Mol. Mass.518.7365
SMILESCN1CCN(Cc2ccc(cc2)-c2cn3CCCCC(O)CCCCCCCCNc4ncc2c3n4)CC1