Reaction Details
TargetTyrosine-protein kinase Mer
LigandBDBM50201147
Substrate/Competitorn/a
Meas. Tech.ChEMBL_1622927 (CHEMBL3865279)
EC50 160±n/a nM
Citation Wang, XLiu, JZhang, WStashko, MANichols, JMiley, MJNorris-Drouin, JChen, ZMachius, MDeRyckere, DWood, EGraham, DKEarp, HSKireev, DFrye, SV Design and Synthesis of Novel Macrocyclic Mer Tyrosine Kinase Inhibitors. ACS Med Chem Lett7:1044-1049 (2016) 
 
Tyrosine-protein kinase Mer
Name:Tyrosine-protein kinase Mer
Type:PROTEIN
Mol. Mass.:110234.77
Organism:Homo sapiens (Human)
Description:ChEMBL_1498723
Residue:999
BDBM50201147
NameBDBM50201147
Synonyms:CHEMBL3986139
TypeSmall organic molecule
Emp. Form.C29H41N5O2
Mol. Mass.491.6681
SMILESOC1CCCCCCCNc2ncc3c(cn(CCCC1)c3n2)-c1ccc(CN2CCOCC2)cc1