Reaction Details
TargetTyrosine-protein kinase Mer
LigandBDBM50201154
Substrate/Competitorn/a
Meas. Tech.ChEMBL_1622927 (CHEMBL3865279)
EC50 400±n/a nM
Citation Wang, XLiu, JZhang, WStashko, MANichols, JMiley, MJNorris-Drouin, JChen, ZMachius, MDeRyckere, DWood, EGraham, DKEarp, HSKireev, DFrye, SV Design and Synthesis of Novel Macrocyclic Mer Tyrosine Kinase Inhibitors. ACS Med Chem Lett7:1044-1049 (2016) 
 
Tyrosine-protein kinase Mer
Name:Tyrosine-protein kinase Mer
Type:PROTEIN
Mol. Mass.:110234.77
Organism:Homo sapiens (Human)
Description:ChEMBL_1498723
Residue:999
BDBM50201154
NameBDBM50201154
Synonyms:CHEMBL3984314
TypeSmall organic molecule
Emp. Form.C32H48N6O
Mol. Mass.532.7631
SMILESCN1CCN(Cc2ccc(cc2)-c2cn3CCCCCC(O)CCCCCCCCNc4ncc2c3n4)CC1