Reaction Details
TargetTyrosine-protein kinase Mer
LigandBDBM50201165
Substrate/Competitorn/a
Meas. Tech.ChEMBL_1622927 (CHEMBL3865279)
EC50 110±n/a nM
Citation Wang, XLiu, JZhang, WStashko, MANichols, JMiley, MJNorris-Drouin, JChen, ZMachius, MDeRyckere, DWood, EGraham, DKEarp, HSKireev, DFrye, SV Design and Synthesis of Novel Macrocyclic Mer Tyrosine Kinase Inhibitors. ACS Med Chem Lett7:1044-1049 (2016) 
 
Tyrosine-protein kinase Mer
Name:Tyrosine-protein kinase Mer
Type:PROTEIN
Mol. Mass.:110234.77
Organism:Homo sapiens (Human)
Description:ChEMBL_1498723
Residue:999
BDBM50201165
NameBDBM50201165
Synonyms:CHEMBL3932614
TypeSmall organic molecule
Emp. Form.C30H44N6O
Mol. Mass.504.71
SMILESCN1CCN(Cc2ccc(cc2)-c2cn3CCCCC(O)CCCCCCCNc4ncc2c3n4)CC1