Reaction Details
TargetTyrosine-protein kinase Mer
LigandBDBM50201077
Substrate/Competitorn/a
Meas. Tech.ChEMBL_1622920 (CHEMBL3865272)
IC50 2.6±n/a nM
Citation Wang, XLiu, JZhang, WStashko, MANichols, JMiley, MJNorris-Drouin, JChen, ZMachius, MDeRyckere, DWood, EGraham, DKEarp, HSKireev, DFrye, SV Design and Synthesis of Novel Macrocyclic Mer Tyrosine Kinase Inhibitors. ACS Med Chem Lett7:1044-1049 (2016) 
 
Tyrosine-protein kinase Mer
Name:Tyrosine-protein kinase Mer
Type:PROTEIN
Mol. Mass.:110234.77
Organism:Homo sapiens (Human)
Description:ChEMBL_1498723
Residue:999
BDBM50201077
NameBDBM50201077
Synonyms:CHEMBL3967759
TypeSmall organic molecule
Emp. Form.C31H46N6O
Mol. Mass.518.7365
SMILESCN1CCN(Cc2ccc(cc2)-c2cn3CCCCC(O)CCCCCCCCNc4ncc2c3n4)CC1