Reaction Details
TargetTyrosine-protein kinase Mer
LigandBDBM50201176
Substrate/Competitorn/a
Meas. Tech.ChEMBL_1622927 (CHEMBL3865279)
EC50>1000±n/a nM
Citation Wang, XLiu, JZhang, WStashko, MANichols, JMiley, MJNorris-Drouin, JChen, ZMachius, MDeRyckere, DWood, EGraham, DKEarp, HSKireev, DFrye, SV Design and Synthesis of Novel Macrocyclic Mer Tyrosine Kinase Inhibitors. ACS Med Chem Lett7:1044-1049 (2016) 
 
Tyrosine-protein kinase Mer
Name:Tyrosine-protein kinase Mer
Type:PROTEIN
Mol. Mass.:110234.77
Organism:Homo sapiens (Human)
Description:ChEMBL_1498723
Residue:999
BDBM50201176
NameBDBM50201176
Synonyms:CHEMBL3943243
TypeSmall organic molecule
Emp. Form.C25H34N4O2
Mol. Mass.422.5631
SMILESCOc1ccccc1-c1cn2CCCCC(O)CCCCCCCNc3ncc1c2n3