Reaction Details
TargetSodium channel protein type 9 subunit alpha
LigandBDBM154049
Substrate/Competitorn/a
Meas. Tech.ChEMBL_1622980 (CHEMBL3865332)
IC50 510±n/a nM
Citation Marx, IEDineen, TAAble, JBode, CBregman, HChu-Moyer, MDiMauro, EFDu, BFoti, RSFremeau, RTGao, HGunaydin, HHall, BEHuang, LKornecook, TKreiman, CRLa, DSLigutti, JLin, MJLiu, DMcDermott, JSMoyer, BDPeterson, EARoberts, JTRose, PWang, JYoungblood, BDYu, VWeiss, MM Sulfonamides as Selective Na ACS Med Chem Lett7:1062-1067 (2016) 
 
Sodium channel protein type 9 subunit alpha
Name:Sodium channel protein type 9 subunit alpha
Type:Protein
Mol. Mass.:226375.97
Organism:Homo sapiens (Human)
Description:Q15858
Residue:1988
BDBM154049
NameBDBM154049
Synonyms:US9012443, 42
TypeSmall organic molecule
Emp. Form.C22H16F3N3O3S
Mol. Mass.459.441
SMILESCOc1cc(ccc1-c1cccc2cc(ccc12)S(=O)(=O)Nc1ccncn1)C(F)(F)F