Reaction Details
TargetSodium channel protein type 5 subunit alpha
LigandBDBM50201181
Substrate/Competitorn/a
Meas. Tech.ChEMBL_1622981 (CHEMBL3865333)
IC50>30000±n/a nM
Citation Marx, IEDineen, TAAble, JBode, CBregman, HChu-Moyer, MDiMauro, EFDu, BFoti, RSFremeau, RTGao, HGunaydin, HHall, BEHuang, LKornecook, TKreiman, CRLa, DSLigutti, JLin, MJLiu, DMcDermott, JSMoyer, BDPeterson, EARoberts, JTRose, PWang, JYoungblood, BDYu, VWeiss, MM Sulfonamides as Selective Na ACS Med Chem Lett7:1062-1067 (2016) 
 
Sodium channel protein type 5 subunit alpha
Name:Sodium channel protein type 5 subunit alpha
Type:Enzyme
Mol. Mass.:226908.60
Organism:Homo sapiens (Human)
Description:Q14524
Residue:2016
BDBM50201181
NameBDBM50201181
Synonyms:CHEMBL3901114
TypeSmall organic molecule
Emp. Form.C22H16F3N3O3S
Mol. Mass.459.441
SMILESCOc1cc(ccc1-c1cccc2cc(ccc12)S(=O)(=O)Nc1ncccn1)C(F)(F)F