Reaction Details
TargetSodium channel protein type 9 subunit alpha
LigandBDBM50201180
Substrate/Competitorn/a
Meas. Tech.ChEMBL_1622980 (CHEMBL3865332)
IC50 1400±n/a nM
Citation Marx, IEDineen, TAAble, JBode, CBregman, HChu-Moyer, MDiMauro, EFDu, BFoti, RSFremeau, RTGao, HGunaydin, HHall, BEHuang, LKornecook, TKreiman, CRLa, DSLigutti, JLin, MJLiu, DMcDermott, JSMoyer, BDPeterson, EARoberts, JTRose, PWang, JYoungblood, BDYu, VWeiss, MM Sulfonamides as Selective Na ACS Med Chem Lett7:1062-1067 (2016) 
 
Sodium channel protein type 9 subunit alpha
Name:Sodium channel protein type 9 subunit alpha
Type:Protein
Mol. Mass.:226375.97
Organism:Homo sapiens (Human)
Description:Q15858
Residue:1988
BDBM50201180
NameBDBM50201180
Synonyms:CHEMBL3910180
TypeSmall organic molecule
Emp. Form.C21H15F3N2O3S2
Mol. Mass.464.481
SMILESCOc1cc(ccc1-c1cccc2cc(ccc12)S(=O)(=O)Nc1cscn1)C(F)(F)F