Reaction Details
TargetSodium channel protein type 2 subunit alpha
LigandBDBM154245
Substrate/Competitorn/a
Meas. Tech.ChEMBL_1623000 (CHEMBL3865352)
IC50 2100±n/a nM
Citation Marx, IEDineen, TAAble, JBode, CBregman, HChu-Moyer, MDiMauro, EFDu, BFoti, RSFremeau, RTGao, HGunaydin, HHall, BEHuang, LKornecook, TKreiman, CRLa, DSLigutti, JLin, MJLiu, DMcDermott, JSMoyer, BDPeterson, EARoberts, JTRose, PWang, JYoungblood, BDYu, VWeiss, MM Sulfonamides as Selective Na ACS Med Chem Lett7:1062-1067 (2016) 
 
Sodium channel protein type 2 subunit alpha
Name:Sodium channel protein type 2 subunit alpha
Type:Enzyme
Mol. Mass.:227954.68
Organism:Homo sapiens (Human)
Description:Q99250
Residue:2005
BDBM154245
NameBDBM154245
Synonyms:US9012443, 261
TypeSmall organic molecule
Emp. Form.C19H13F3N4O3S2
Mol. Mass.466.457
SMILESCOc1cc(ccc1-c1ncnc2cc(ccc12)S(=O)(=O)Nc1nccs1)C(F)(F)F