Reaction Details
TargetSodium channel protein type 9 subunit alpha
LigandBDBM154245
Substrate/Competitorn/a
Meas. Tech.ChEMBL_1623005 (CHEMBL3865357)
IC50 140±n/a nM
Citation Marx, IEDineen, TAAble, JBode, CBregman, HChu-Moyer, MDiMauro, EFDu, BFoti, RSFremeau, RTGao, HGunaydin, HHall, BEHuang, LKornecook, TKreiman, CRLa, DSLigutti, JLin, MJLiu, DMcDermott, JSMoyer, BDPeterson, EARoberts, JTRose, PWang, JYoungblood, BDYu, VWeiss, MM Sulfonamides as Selective Na ACS Med Chem Lett7:1062-1067 (2016) 
 
Sodium channel protein type 9 subunit alpha
Name:Sodium channel protein type 9 subunit alpha
Type:Protein
Mol. Mass.:226375.97
Organism:Homo sapiens (Human)
Description:Q15858
Residue:1988
BDBM154245
NameBDBM154245
Synonyms:US9012443, 261
TypeSmall organic molecule
Emp. Form.C19H13F3N4O3S2
Mol. Mass.466.457
SMILESCOc1cc(ccc1-c1ncnc2cc(ccc12)S(=O)(=O)Nc1nccs1)C(F)(F)F