Reaction Details
TargetProcathepsin L
LigandBDBM50201260
Substrate/Competitorn/a
Meas. Tech.ChEMBL_1623051 (CHEMBL3865403)
Ki 46±n/a nM
Citation Latorre, ASchirmeister, TKesselring, JJung, SJohé, PHellmich, UAHeilos, AEngels, BKrauth-Siegel, RLDirdjaja, NBou-Iserte, LRodríguez, SGonzález, FV Dipeptidyl Nitroalkenes as Potent Reversible Inhibitors of Cysteine Proteases Rhodesain and Cruzain. ACS Med Chem Lett7:1073-1076 (2016) 
 
Procathepsin L
Name:Procathepsin L
Type:Enzyme
Mol. Mass.:37557.19
Organism:Homo sapiens (Human)
Description:Purchased from Calbiochem (San Diego, CA).
Residue:333
BDBM50201260
NameBDBM50201260
Synonyms:CHEMBL3921142
TypeSmall organic molecule
Emp. Form.C21H31N3O5
Mol. Mass.405.4879
SMILESCC(C)C[C@H](NC(=O)[C@H](CC(C)C)NC(=O)OCc1ccccc1)\C=C\[N+]([O-])=O