Reaction Details
TargetProcathepsin L
LigandBDBM50201212
Substrate/Competitorn/a
Meas. Tech.ChEMBL_1623051 (CHEMBL3865403)
Ki 20±n/a nM
Citation Latorre, ASchirmeister, TKesselring, JJung, SJohé, PHellmich, UAHeilos, AEngels, BKrauth-Siegel, RLDirdjaja, NBou-Iserte, LRodríguez, SGonzález, FV Dipeptidyl Nitroalkenes as Potent Reversible Inhibitors of Cysteine Proteases Rhodesain and Cruzain. ACS Med Chem Lett7:1073-1076 (2016) 
 
Procathepsin L
Name:Procathepsin L
Type:Enzyme
Mol. Mass.:37557.19
Organism:Homo sapiens (Human)
Description:Purchased from Calbiochem (San Diego, CA).
Residue:333
BDBM50201212
NameBDBM50201212
Synonyms:CHEMBL3974129
TypeSmall organic molecule
Emp. Form.C28H29N3O5
Mol. Mass.487.547
SMILES[O-][N+](=O)\C=C\[C@H](CCc1ccccc1)NC(=O)[C@H](Cc1ccccc1)NC(=O)OCc1ccccc1