Reaction Details
TargetCoagulation factor VII/Tissue factor
LigandBDBM50201263
Substrate/Competitorn/a
Meas. Tech.ChEMBL_1623064 (CHEMBL3865416)
Ki 13±n/a nM
Citation Wurtz, NRParkhurst, BLJiang, WDeLucca, IZhang, XLadziata, VCheney, DLBozarth, JRRendina, ARWei, ALuettgen, JMWu, YWong, PCSeiffert, DAWexler, RRPriestley, ES Discovery of Phenylglycine Lactams as Potent Neutral Factor VIIa Inhibitors. ACS Med Chem Lett7:1077-1081 (2016) 
 
Coagulation factor VII/Tissue factor
Name:Coagulation factor VII/Tissue factor
Type:n/a
Mol. Mass.:n/a
Description:ASSAY_ID of EBI is 69535
Components:This complex has 2 components.
Component 1
Name:Tissue factor
Synonyms:CD_antigen=CD142 Coagulation factor VII/tissue factor TF Thromboplastin | Tissue factor
Type:PROTEIN
Mol. Mass.:33067.61
Organism:Homo sapiens (Human)
Description:ChEMBL_936735
Residue:295
Component 2
Name:Coagulation factor VII
Synonyms:Eptacog alfa FA7_HUMAN Factor VIIa (fVIIa) SPCA serum prothrombin conversion accelerator
Type:Enzyme
Mol. Mass.:51599.89
Organism:Homo sapiens (Human)
Description:n/a
Residue:466
BDBM50201263
NameBDBM50201263
Synonyms:CHEMBL3962367
TypeSmall organic molecule
Emp. Form.C33H37FN4O8S
Mol. Mass.668.732
SMILESCOC(=O)Nc1ccc(c(c1)[C@H]1CCCN1C(=O)[C@H](Nc1cc2C(=O)NCc2cc1F)c1ccc(OC)c(OC)c1)S(=O)(=O)C(C)C