Reaction Details
TargetKallikrein-1
LigandBDBM50201265
Substrate/Competitorn/a
Meas. Tech.ChEMBL_1623067 (CHEMBL3865419)
Ki>100000±n/a nM
Citation Wurtz, NRParkhurst, BLJiang, WDeLucca, IZhang, XLadziata, VCheney, DLBozarth, JRRendina, ARWei, ALuettgen, JMWu, YWong, PCSeiffert, DAWexler, RRPriestley, ES Discovery of Phenylglycine Lactams as Potent Neutral Factor VIIa Inhibitors. ACS Med Chem Lett7:1077-1081 (2016) 
 
Kallikrein-1
Name:Kallikrein-1
Type:Enzyme
Mol. Mass.:28874.69
Organism:Homo sapiens (Human)
Description:P06870
Residue:262
BDBM50201265
NameBDBM50201265
Synonyms:CHEMBL3947087
TypeSmall organic molecule
Emp. Form.C32H38N4O8S
Mol. Mass.638.731
SMILESCOC(=O)Nc1ccc(c(c1)[C@@H]1CCCN1C(=O)[C@H](Nc1cccc(c1)C(N)=O)c1ccc(OC)c(OC)c1)S(=O)(=O)C(C)C