Reaction Details
TargetProthrombin
LigandBDBM50201262
Substrate/Competitorn/a
Meas. Tech.ChEMBL_1623082 (CHEMBL3865434)
Ki>1000±n/a nM
Citation Wurtz, NRParkhurst, BLJiang, WDeLucca, IZhang, XLadziata, VCheney, DLBozarth, JRRendina, ARWei, ALuettgen, JMWu, YWong, PCSeiffert, DAWexler, RRPriestley, ES Discovery of Phenylglycine Lactams as Potent Neutral Factor VIIa Inhibitors. ACS Med Chem Lett7:1077-1081 (2016) 
 
Prothrombin
Name:Prothrombin
Type:Protein
Mol. Mass.:70029.57
Organism:Homo sapiens (Human)
Description:P00734
Residue:622
BDBM50201262
NameBDBM50201262
Synonyms:CHEMBL3949343
TypeSmall organic molecule
Emp. Form.C34H38N4O8S
Mol. Mass.662.753
SMILESCOC(=O)Nc1ccc(c(c1)[C@H]1CCCN1C(=O)[C@H](Nc1ccc2cc[nH]c(=O)c2c1)c1ccc(OC)c(OC)c1)S(=O)(=O)C(C)C