Reaction Details
TargetCoagulation factor IX
LigandBDBM50201263
Substrate/Competitorn/a
Meas. Tech.ChEMBL_1623079 (CHEMBL3865431)
Ki>1000±n/a nM
Citation Wurtz, NRParkhurst, BLJiang, WDeLucca, IZhang, XLadziata, VCheney, DLBozarth, JRRendina, ARWei, ALuettgen, JMWu, YWong, PCSeiffert, DAWexler, RRPriestley, ES Discovery of Phenylglycine Lactams as Potent Neutral Factor VIIa Inhibitors. ACS Med Chem Lett7:1077-1081 (2016) 
 
Coagulation factor IX
Name:Coagulation factor IX
Type:Enzyme
Mol. Mass.:51768.83
Organism:Homo sapiens (Human)
Description:P00740
Residue:461
BDBM50201263
NameBDBM50201263
Synonyms:CHEMBL3962367
TypeSmall organic molecule
Emp. Form.C33H37FN4O8S
Mol. Mass.668.732
SMILESCOC(=O)Nc1ccc(c(c1)[C@H]1CCCN1C(=O)[C@H](Nc1cc2C(=O)NCc2cc1F)c1ccc(OC)c(OC)c1)S(=O)(=O)C(C)C