Reaction Details
TargetMetabotropic glutamate receptor 5
LigandBDBM50201538
Substrate/Competitorn/a
Meas. Tech.ChEMBL_1623092 (CHEMBL3865444)
EC50 110±n/a nM
Citation Hill, MDFang, HBrown, JMMolski, TEaston, AHan, XMiller, RHill-Drzewi, MGallagher, LMatchett, MGulianello, MBalakrishnan, ABertekap, RLSantone, KSWhiterock, VJZhuo, XBronson, JJMacor, JEDegnan, AP Development of 1 ACS Med Chem Lett7:1082-1086 (2016) 
 
Metabotropic glutamate receptor 5
Name:Metabotropic glutamate receptor 5
Type:Enzyme
Mol. Mass.:132484.72
Organism:Homo sapiens (Human)
Description:n/a
Residue:1212
BDBM50201538
NameBDBM50201538
Synonyms:CHEMBL3891001
TypeSmall organic molecule
Emp. Form.C23H17ClN4O
Mol. Mass.400.86
SMILESCOc1cc(ccc1Cl)-c1n[nH]c2nc(-c3ccccc3)c(C#N)c(C3CC3)c12