Reaction Details
TargetMetabotropic glutamate receptor 5
LigandBDBM50169542
Substrate/Competitorn/a
Meas. Tech.ChEMBL_1623100 (CHEMBL3865452)
IC50 3.0±n/a nM
Citation Hill, MDFang, HBrown, JMMolski, TEaston, AHan, XMiller, RHill-Drzewi, MGallagher, LMatchett, MGulianello, MBalakrishnan, ABertekap, RLSantone, KSWhiterock, VJZhuo, XBronson, JJMacor, JEDegnan, AP Development of 1 ACS Med Chem Lett7:1082-1086 (2016) 
 
Metabotropic glutamate receptor 5
Name:Metabotropic glutamate receptor 5
Type:Enzyme
Mol. Mass.:132484.72
Organism:Homo sapiens (Human)
Description:n/a
Residue:1212
BDBM50169542
NameBDBM50169542
Synonyms:CHEMBL3804846
TypeSmall organic molecule
Emp. Form.C22H14F2N2O2
Mol. Mass.376.3556
SMILESFc1ccc(F)c(c1)[C@H]1OC(=O)N[C@@H]1c1cncc(c1)C#Cc1ccccc1