Reaction Details
TargetMetabotropic glutamate receptor 5
LigandBDBM50201558
Substrate/Competitorn/a
Meas. Tech.ChEMBL_1623102 (CHEMBL3865454)
IC50 27±n/a nM
Citation Hill, MDFang, HBrown, JMMolski, TEaston, AHan, XMiller, RHill-Drzewi, MGallagher, LMatchett, MGulianello, MBalakrishnan, ABertekap, RLSantone, KSWhiterock, VJZhuo, XBronson, JJMacor, JEDegnan, AP Development of 1 ACS Med Chem Lett7:1082-1086 (2016) 
 
Metabotropic glutamate receptor 5
Name:Metabotropic glutamate receptor 5
Type:Enzyme
Mol. Mass.:131900.14
Organism:Rattus norvegicus (Rat)
Description:P31424
Residue:1203
BDBM50201558
NameBDBM50201558
Synonyms:CHEMBL3895289
TypeSmall organic molecule
Emp. Form.C22H15ClN4
Mol. Mass.370.834
SMILESClc1cccc(c1)-c1n[nH]c2nc(-c3ccccc3)c(C#N)c(C3CC3)c12