Reaction Details
TargetComplement factor D
LigandBDBM50201567
Substrate/Competitorn/a
Meas. Tech.ChEMBL_1623109 (CHEMBL3865461)
IC50 3700±n/a nM
Citation Yang, CYPhillips, JGStuckey, JABai, LSun, HDelproposto, JBrown, WCChinnaswamy, K Buried Hydrogen Bond Interactions Contribute to the High Potency of Complement Factor D Inhibitors. ACS Med Chem Lett7:1092-1096 (2016) 
 
Complement factor D
Name:Complement factor D
Type:Protein
Mol. Mass.:27039.19
Organism:Homo sapiens (Human)
Description:P00746
Residue:253
BDBM50201567
NameBDBM50201567
Synonyms:CHEMBL3901198
TypeSmall organic molecule
Emp. Form.C20H20N6S3
Mol. Mass.440.608
SMILESCCCc1c(cnn1-c1ccccn1)-c1csc(n1)-c1cc(sc1SC)C(N)=N