Reaction Details
TargetComplement factor D
LigandBDBM50201568
Substrate/Competitorn/a
Meas. Tech.ChEMBL_1623110 (CHEMBL3865462)
IC50 6600±n/a nM
Citation Yang, CYPhillips, JGStuckey, JABai, LSun, HDelproposto, JBrown, WCChinnaswamy, K Buried Hydrogen Bond Interactions Contribute to the High Potency of Complement Factor D Inhibitors. ACS Med Chem Lett7:1092-1096 (2016) 
 
Complement factor D
Name:Complement factor D
Type:Protein
Mol. Mass.:27039.19
Organism:Homo sapiens (Human)
Description:P00746
Residue:253
BDBM50201568
NameBDBM50201568
Synonyms:CHEMBL3951127
TypeSmall organic molecule
Emp. Form.C20H18BrN5O2
Mol. Mass.440.293
SMILES[H][C@]12C[C@@]1([H])N([C@@H](C2)C(=O)Nc1cccc(Br)n1)C(=O)Cn1ncc2ccccc12