Reaction Details
TargetComplement factor D
LigandBDBM50201569
Substrate/Competitorn/a
Meas. Tech.ChEMBL_1623115 (CHEMBL3865467)
IC50 77±n/a nM
Citation Yang, CYPhillips, JGStuckey, JABai, LSun, HDelproposto, JBrown, WCChinnaswamy, K Buried Hydrogen Bond Interactions Contribute to the High Potency of Complement Factor D Inhibitors. ACS Med Chem Lett7:1092-1096 (2016) 
 
Complement factor D
Name:Complement factor D
Type:Protein
Mol. Mass.:27039.19
Organism:Homo sapiens (Human)
Description:P00746
Residue:253
BDBM50201569
NameBDBM50201569
Synonyms:CHEMBL3924715
TypeSmall organic molecule
Emp. Form.C18H16BrN5O2S
Mol. Mass.446.321
SMILESBrc1cccc(NC(=O)[C@@H]2SCCN2C(=O)Cn2ncc3ccccc23)n1