Reaction Details
TargetSerine/threonine-protein kinase PAK 1
LigandBDBM50201652
Substrate/Competitorn/a
Meas. Tech.ChEMBL_1623177 (CHEMBL3865529)
IC50 19±n/a nM
Citation McCoull, WHennessy, EJBlades, KChuaqui, CDowling, JEFerguson, ADGoldberg, FWHowe, NJones, CRKemmitt, PDLamont, GVarnes, JGWard, RAYang, B Optimization of Highly Kinase Selective Bis-anilino Pyrimidine PAK1 Inhibitors. ACS Med Chem Lett7:1118-1123 (2016) 
 
Serine/threonine-protein kinase PAK 1
Name:Serine/threonine-protein kinase PAK 1
Type:n/a
Mol. Mass.:60640.15
Organism:Homo sapiens (Human)
Description:Q13153
Residue:545
BDBM50201652
NameBDBM50201652
Synonyms:CHEMBL3891484
TypeSmall organic molecule
Emp. Form.C24H28FN5O4S
Mol. Mass.501.574
SMILESCN(c1ccc(C)c(CO)c1)c1nc(Nc2cc(cc(c2)S(C)(=O)=O)N2CCOCC2)ncc1F