Reaction Details
TargetSerine/threonine-protein kinase PAK 1
LigandBDBM50201654
Substrate/Competitorn/a
Meas. Tech.ChEMBL_1623177 (CHEMBL3865529)
IC50 0.580000±n/a nM
Citation McCoull, WHennessy, EJBlades, KChuaqui, CDowling, JEFerguson, ADGoldberg, FWHowe, NJones, CRKemmitt, PDLamont, GVarnes, JGWard, RAYang, B Optimization of Highly Kinase Selective Bis-anilino Pyrimidine PAK1 Inhibitors. ACS Med Chem Lett7:1118-1123 (2016) 
 
Serine/threonine-protein kinase PAK 1
Name:Serine/threonine-protein kinase PAK 1
Type:n/a
Mol. Mass.:60640.15
Organism:Homo sapiens (Human)
Description:Q13153
Residue:545
BDBM50201654
NameBDBM50201654
Synonyms:CHEMBL3964858
TypeSmall organic molecule
Emp. Form.C28H35FN6O3S
Mol. Mass.554.679
SMILES[H][C@]12CN(c3ccc(Nc4ncc(F)c(n4)N(C)c4cc(CO)c(C)cc4C)cc3S(=O)(=O)CC)[C@]([H])(CN1C)C2