Reaction Details
TargetSerine/threonine-protein kinase PAK 1
LigandBDBM50201641
Substrate/Competitorn/a
Meas. Tech.ChEMBL_1623177 (CHEMBL3865529)
IC50 0.330000±n/a nM
Citation McCoull, WHennessy, EJBlades, KChuaqui, CDowling, JEFerguson, ADGoldberg, FWHowe, NJones, CRKemmitt, PDLamont, GVarnes, JGWard, RAYang, B Optimization of Highly Kinase Selective Bis-anilino Pyrimidine PAK1 Inhibitors. ACS Med Chem Lett7:1118-1123 (2016) 
 
Serine/threonine-protein kinase PAK 1
Name:Serine/threonine-protein kinase PAK 1
Type:n/a
Mol. Mass.:60640.15
Organism:Homo sapiens (Human)
Description:Q13153
Residue:545
BDBM50201641
NameBDBM50201641
Synonyms:CHEMBL3923175
TypeSmall organic molecule
Emp. Form.C33H36FN7O3S
Mol. Mass.629.747
SMILESCCS(=O)(=O)c1cc(Nc2ncc(F)c(n2)N(Cc2ccccc2C#N)c2cc(CO)ccc2C)ccc1N1CCN(C)CC1