Reaction Details
TargetPhosphatidylinositol 4,5-bisphosphate 3-kinase catalytic subunit delta isoform
LigandBDBM50201721
Substrate/Competitorn/a
Meas. Tech.ChEMBL_1623334 (CHEMBL3865686)
IC50 8.0±n/a nM
Citation Pujala, BAgarwal, AKMiddya, SBanerjee, MSurya, ANayak, AKGupta, AKhare, SGuguloth, RRandive, NAShinde, BUThakur, APatel, DIRaja, MGreen, MJAlfaro, JAvila, PPérez de Arce, FAlmirez, RGKanno, SBernales, SHung, DTChakravarty, SMcCullagh, EQuinn, KPRai, RPham, SM Discovery of Pyrazolopyrimidine Derivatives as Novel Dual Inhibitors of BTK and PI3Kd. ACS Med Chem Lett7:1161-1166 (2016) 
 
Phosphatidylinositol 4,5-bisphosphate 3-kinase catalytic subunit delta isoform
Name:Phosphatidylinositol 4,5-bisphosphate 3-kinase catalytic subunit delta isoform
Type:Enzyme Subunit
Mol. Mass.:119489.41
Organism:Homo sapiens (Human)
Description:O00329
Residue:1044
BDBM50201721
NameBDBM50201721
Synonyms:CHEMBL3964073
TypeSmall organic molecule
Emp. Form.C20H16BrN5O
Mol. Mass.422.278
SMILESNc1ncnc2n(nc(-c3ccc(Br)c(O)c3)c12)C1Cc2ccccc2C1