Reaction Details
TargetPhosphatidylinositol 4,5-bisphosphate 3-kinase catalytic subunit delta isoform
LigandBDBM50201724
Substrate/Competitorn/a
Meas. Tech.ChEMBL_1623334 (CHEMBL3865686)
IC50 32±n/a nM
Citation Pujala, BAgarwal, AKMiddya, SBanerjee, MSurya, ANayak, AKGupta, AKhare, SGuguloth, RRandive, NAShinde, BUThakur, APatel, DIRaja, MGreen, MJAlfaro, JAvila, PPérez de Arce, FAlmirez, RGKanno, SBernales, SHung, DTChakravarty, SMcCullagh, EQuinn, KPRai, RPham, SM Discovery of Pyrazolopyrimidine Derivatives as Novel Dual Inhibitors of BTK and PI3Kd. ACS Med Chem Lett7:1161-1166 (2016) 
 
Phosphatidylinositol 4,5-bisphosphate 3-kinase catalytic subunit delta isoform
Name:Phosphatidylinositol 4,5-bisphosphate 3-kinase catalytic subunit delta isoform
Type:Enzyme Subunit
Mol. Mass.:119489.41
Organism:Homo sapiens (Human)
Description:O00329
Residue:1044
BDBM50201724
NameBDBM50201724
Synonyms:CHEMBL3983045
TypeSmall organic molecule
Emp. Form.C21H19N5O2
Mol. Mass.373.4079
SMILESCOc1ccc(cc1O)-c1nn(C2Cc3ccccc3C2)c2ncnc(N)c12