Reaction Details
TargetApoptosis regulator Bcl-2
LigandBDBM50201732
Substrate/Competitorn/a
Meas. Tech.ChEMBL_1623373 (CHEMBL3865725)
Ki 5.0±n/a nM
Citation Lu, YWu, SYue, YHe, SLi, JTang, JWang, WZhou, HB Gossypol with Hydrophobic Linear Esters Exhibits Enhanced Antitumor Activity as an Inhibitor of Antiapoptotic Proteins. ACS Med Chem Lett7:1185-1190 (2016) 
 
Apoptosis regulator Bcl-2
Name:Apoptosis regulator Bcl-2
Type:Homodimer or heterodimer
Mol. Mass.:26269.11
Organism:Homo sapiens (Human)
Description:P10415
Residue:239
BDBM50201732
NameBDBM50201732
Synonyms:CHEMBL3929718
TypeSmall organic molecule
Emp. Form.C35H38N2O10
Mol. Mass.646.6836
SMILESCOC(=O)CN\C=C1/C(=O)C(O)=C(C(C)C)c2cc(C)c(c(O)c12)-c1c(C)cc2C(C(C)C)=C(O)C(=O)\C(=C/NC(=O)OC)c2c1O