Reaction Details
TargetInduced myeloid leukemia cell differentiation protein Mcl-1
LigandBDBM23223
Substrate/Competitorn/a
Meas. Tech.ChEMBL_1623372 (CHEMBL3865724)
Ki 162±n/a nM
Citation Lu, YWu, SYue, YHe, SLi, JTang, JWang, WZhou, HB Gossypol with Hydrophobic Linear Esters Exhibits Enhanced Antitumor Activity as an Inhibitor of Antiapoptotic Proteins. ACS Med Chem Lett7:1185-1190 (2016) 
 
Induced myeloid leukemia cell differentiation protein Mcl-1
Name:Induced myeloid leukemia cell differentiation protein Mcl-1
Type:Membrane; Single-pass membrane protein
Mol. Mass.:37332.87
Organism:Homo sapiens (Human)
Description:Q07820
Residue:350
BDBM23223
NameBDBM23223
Synonyms:7-[8-formyl-1,6,7-trihydroxy-3-methyl-5-(propan-2-yl)naphthalen-2-yl]-2,3,8-trihydroxy-6-methyl-4-(propan-2-yl)naphthalene-1-carbaldehyde Gossypol Gossypol, 4 Tash 1 cid_3503
TypeSmall organic molecule
Emp. Form.C30H30O8
Mol. Mass.518.5544
SMILESCC(C)c1c(O)c(O)c(C=O)c2c(O)c(c(C)cc12)-c1c(C)cc2c(C(C)C)c(O)c(O)c(C=O)c2c1O