Reaction Details
TargetN-acetyltransferase Eis
LigandBDBM50201742
Substrate/Competitorn/a
Meas. Tech.ChEMBL_1623397 (CHEMBL3865749)
IC50 160±n/a nM
Citation Garzan, AWillby, MJGreen, KDTsodikov, OVPosey, JEGarneau-Tsodikova, S Discovery and Optimization of Two Eis Inhibitor Families as Kanamycin Adjuvants against Drug-Resistant ACS Med Chem Lett7:1219-1221 (2016) 
 
N-acetyltransferase Eis
Name:N-acetyltransferase Eis
Type:PROTEIN
Mol. Mass.:43803.37
Organism:Mycobacterium tuberculosis (strain ATCC 25618 / H37Rv)
Description:ChEMBL_116995
Residue:402
BDBM50201742
NameBDBM50201742
Synonyms:CHEMBL3950034
TypeSmall organic molecule
Emp. Form.C16H12FNO4
Mol. Mass.301.2692
SMILESCOC(=O)c1cc2occc2n1CC(=O)c1cccc(F)c1