Reaction Details
TargetVascular endothelial growth factor receptor 2
LigandBDBM50201766
Substrate/Competitorn/a
Meas. Tech.ChEMBL_1623427 (CHEMBL3865779)
IC50 3600±n/a nM
Citation Wang, WWu, CWang, JLuo, RWang, CLiu, XLi, JZhu, WZheng, P Synthesis, activity and docking studies of phenylpyrimidine-carboxamide Sorafenib derivatives. Bioorg Med Chem24:6166-6173 (2016) 
 
Vascular endothelial growth factor receptor 2
Name:Vascular endothelial growth factor receptor 2
Type:Receptor Tyrosine Kinase
Mol. Mass.:151510.97
Organism:Homo sapiens (Human)
Description:P35968
Residue:1356
BDBM50201766
NameBDBM50201766
Synonyms:CHEMBL3931691
TypeSmall organic molecule
Emp. Form.C26H23N5O3
Mol. Mass.453.4925
SMILESCCc1ccc(cc1)-c1cc(ncn1)C(=O)Nc1ccc(Oc2ccnc(c2)C(=O)NC)cc1