Reaction Details
TargetCell division protein FtsZ
LigandBDBM50203126
Substrate/Competitorn/a
Meas. Tech.ChEMBL_1623458 (CHEMBL3865870)
IC50 10000±n/a nM
Citation Haranahalli, KTong, SOjima, I Recent advances in the discovery and development of antibacterial agents targeting the cell-division protein FtsZ. Bioorg Med Chem24:6354-6369 (2016) 
 
Cell division protein FtsZ
Name:Cell division protein FtsZ
Type:Protein
Mol. Mass.:40305.83
Organism:Escherichia coli
Description:P0A9A6
Residue:383
BDBM50203126
NameBDBM50203126
Synonyms:3,4-dimethoxy-6,7-dihydro-[1,3]dioxolo[4,5-g]pyrido[2,1-a]isoquinolin-5-ylium 9,10-Dimethoxy-5,6-dihydro-[1,3]dioxolo[4,5-g]isoquino[3,2-a]isoquinolin-7-ylium chloride BERBERINE CHEMBL12089 cid_12456
TypeSmall organic molecule
Emp. Form.C20H18NO4
Mol. Mass.336.3607
SMILESCOc1ccc2cc3-c4cc5OCOc5cc4CC[n+]3cc2c1OC